Reaction Details
TargetGlycogen synthase kinase-3 alpha
LigandBDBM303238
Substrate/Competitorn/a
Meas. Tech.Caliper Assay
IC50<100±n/a nM
Citation Wagner, FFPan, JQDandapani, SGermain, AHolson, EMunoz, BNag, PPLewis, MCHaggarty, SJBishop, JAStegmaier, KWeiwer, MBanerji, V Kinase inhibitors and methods of use thereof US Patent US10137122 Publication Date 11/27/2018
 
Glycogen synthase kinase-3 alpha
Name:Glycogen synthase kinase-3 alpha
Type:Enzyme
Mol. Mass.:50991.79
Organism:Homo sapiens (Human)
Description:P49840
Residue:483
BDBM303238
NameBDBM303238
Synonyms:US10137122, Compound 116
TypeSmall organic molecule
Emp. Form.C22H24FN3O
Mol. Mass.365.4439
SMILESCC1(C)CC(=O)C2=C(C1)Nc1n[nH]c(C3CC3)c1C2(C)c1ccccc1F