Reaction Details
TargetAmyloid-beta precursor protein
LigandBDBM303149
Substrate/Competitorn/a
Meas. Tech.Radiolabeling of ThT and Radioligand Binding Assay
Ki 2.30±n/a nM
Citation Klunk, WEMathis, Jr., CAWang, Y Thioflavin derivatives for use in antemortem diagnosis of Alzheimer's disease and in vivo imaging and prevention of amyloid deposition US Patent US10137210 Publication Date 11/27/2018
 
Amyloid-beta precursor protein
Name:Amyloid-beta precursor protein
Type:Single-pass type I membrane protein
Mol. Mass.:86890.41
Organism:Homo sapiens (Human)
Description:P05067
Residue:770
BDBM303149
NameBDBM303149
Synonyms:US10137210, Example [N-methyl-11C]6-MeO-BTA-2
TypeSmall organic molecule
Emp. Form.C16H16N2OS
Mol. Mass.284.376
SMILESCN(C)c1ccc(cc1)-c1nc2ccc(CO)cc2s1