Reaction Details
TargetAmyloid-beta precursor protein
LigandBDBM50109052
Substrate/Competitorn/a
Meas. Tech.Radiolabeling of ThT and Radioligand Binding Assay
Ki 9.60±n/a nM
Citation Klunk, WEMathis, Jr., CAWang, Y Thioflavin derivatives for use in antemortem diagnosis of Alzheimer's disease and in vivo imaging and prevention of amyloid deposition US Patent US10137210 Publication Date 11/27/2018
 
Amyloid-beta precursor protein
Name:Amyloid-beta precursor protein
Type:Single-pass type I membrane protein
Mol. Mass.:86890.41
Organism:Homo sapiens (Human)
Description:P05067
Residue:770
BDBM50109052
NameBDBM50109052
Synonyms:(4-Benzothiazol-2-yl-phenyl)-methyl-amine CHEMBL93334 | US10137210, Example [N-methyl-11C]BTA-1
TypeSmall organic molecule
Emp. Form.C14H12N2S
Mol. Mass.240.323
SMILESCNc1ccc(cc1)-c1nc2ccccc2s1