Reaction Details
TargetAmyloid-beta precursor protein
LigandBDBM303156
Substrate/Competitorn/a
Meas. Tech.Radiolabeling of ThT and Radioligand Binding Assay
Ki 8.32±n/a nM
Citation Klunk, WEMathis, Jr., CAWang, Y Thioflavin derivatives for use in antemortem diagnosis of Alzheimer's disease and in vivo imaging and prevention of amyloid deposition US Patent US10137210 Publication Date 11/27/2018
 
Amyloid-beta precursor protein
Name:Amyloid-beta precursor protein
Type:Single-pass type I membrane protein
Mol. Mass.:86890.41
Organism:Homo sapiens (Human)
Description:P05067
Residue:770
BDBM303156
NameBDBM303156
Synonyms:US10137210, Example 00023
TypeSmall organic molecule
Emp. Form.C13H9IN2S
Mol. Mass.352.193
SMILESNc1ccc(cc1I)-c1nc2ccccc2s1