Reaction Details
TargetAdenosine receptor A2a
LigandBDBM50200981
Substrate/Competitorn/a
Meas. Tech.A2a Ki assay
Ki 0.200±n/a nM
Citation Ali, AKuang, RLim, YLo, MMTing, PCBiju, Pde Lera Ruiz, MDegrado, SJTung, ALHenderson, TJHong, LKim, JKim, DWLee, JWu, JWu, HXiao, YYu, TZhou, GZhu, XMcCormick, KDTagat, JRXiao, DKhan, TCao, JBerlin, MZhang, Y Aminoquinazoline compounds as A2A antagonist US Patent US10138212 Publication Date 11/27/2018
 
Adenosine receptor A2a
Name:Adenosine receptor A2a
Type:G Protein-Coupled Receptor (GPCR)
Mol. Mass.:44716.46
Organism:Homo sapiens (Human)
Description:P29274
Residue:412
BDBM50200981
NameBDBM50200981
Synonyms:CHEMBL3960148 | US10138212, Example 6
TypeSmall organic molecule
Emp. Form.C20H21N5O2
Mol. Mass.363.413
SMILESCOc1cccc2c(nc(N)nc12)C(=O)NCc1cccc(n1)C1CCC1