Reaction Details
TargetAdenosine receptor A2a
LigandBDBM303287
Substrate/Competitorn/a
Meas. Tech.A2a Ki assay
Ki 1.10±n/a nM
Citation Ali, AKuang, RLim, YLo, MMTing, PCBiju, Pde Lera Ruiz, MDegrado, SJTung, ALHenderson, TJHong, LKim, JKim, DWLee, JWu, JWu, HXiao, YYu, TZhou, GZhu, XMcCormick, KDTagat, JRXiao, DKhan, TCao, JBerlin, MZhang, Y Aminoquinazoline compounds as A2A antagonist US Patent US10138212 Publication Date 11/27/2018
 
Adenosine receptor A2a
Name:Adenosine receptor A2a
Type:G Protein-Coupled Receptor (GPCR)
Mol. Mass.:44716.46
Organism:Homo sapiens (Human)
Description:P29274
Residue:412
BDBM303287
NameBDBM303287
Synonyms:2-amino-8-methoxy-N- [[6-[[(3S)- tetrahydrofuran-3- yl]oxymethyl]-2- pyridyl]methyl]quinazoline- 4-carboxamide | US10138212, Example 52
TypeSmall organic molecule
Emp. Form.C21H23N5O4
Mol. Mass.409.4384
SMILESCOc1cccc2c(nc(N)nc12)C(=O)NCc1cccc(CO[C@H]2CCOC2)n1