Reaction Details
TargetAdenosine receptor A2a
LigandBDBM303313
Substrate/Competitorn/a
Meas. Tech.A2a Ki assay
Ki 0.500±n/a nM
Citation Ali, AKuang, RLim, YLo, MMTing, PCBiju, Pde Lera Ruiz, MDegrado, SJTung, ALHenderson, TJHong, LKim, JKim, DWLee, JWu, JWu, HXiao, YYu, TZhou, GZhu, XMcCormick, KDTagat, JRXiao, DKhan, TCao, JBerlin, MZhang, Y Aminoquinazoline compounds as A2A antagonist US Patent US10138212 Publication Date 11/27/2018
 
Adenosine receptor A2a
Name:Adenosine receptor A2a
Type:G Protein-Coupled Receptor (GPCR)
Mol. Mass.:44716.46
Organism:Homo sapiens (Human)
Description:P29274
Residue:412
BDBM303313
NameBDBM303313
Synonyms:2-amino-8-fluoro-N-[(3- fluoro-6-methyl-2- pyridyl)methyl] quinazoline-4- carboxamide | US10138212, Example 76
TypeSmall organic molecule
Emp. Form.C16H13F2N5O
Mol. Mass.329.3041
SMILESCc1ccc(F)c(CNC(=O)c2nc(N)nc3c(F)cccc23)n1