Reaction Details
TargetAdenosine receptor A2a
LigandBDBM303336
Substrate/Competitorn/a
Meas. Tech.A2a Ki assay
Ki 1.70±n/a nM
Citation Ali, AKuang, RLim, YLo, MMTing, PCBiju, Pde Lera Ruiz, MDegrado, SJTung, ALHenderson, TJHong, LKim, JKim, DWLee, JWu, JWu, HXiao, YYu, TZhou, GZhu, XMcCormick, KDTagat, JRXiao, DKhan, TCao, JBerlin, MZhang, Y Aminoquinazoline compounds as A2A antagonist US Patent US10138212 Publication Date 11/27/2018
 
Adenosine receptor A2a
Name:Adenosine receptor A2a
Type:G Protein-Coupled Receptor (GPCR)
Mol. Mass.:44716.46
Organism:Homo sapiens (Human)
Description:P29274
Residue:412
BDBM303336
NameBDBM303336
Synonyms:2-amino-N-[(3-fluoro-6- methyl-2- pyridyl)methyl]-8- oxazol-2-yl-quinazoline- 4-carboxamide | US10138212, Example 98
TypeSmall organic molecule
Emp. Form.C19H15FN6O2
Mol. Mass.378.3598
SMILESCc1ccc(F)c(CNC(=O)c2nc(N)nc3c(cccc23)-c2ncco2)n1