Reaction Details
TargetReceptor-interacting serine/threonine-protein kinase 2
LigandBDBM303362
Substrate/Competitorn/a
Meas. Tech.V9103X ADP-Glo Kinase Assay Custom
IC50 1.10±n/a nM
Citation Cui, JGao, DALiu, PMcKibben, BPMiller, CARazavi, HSpencer, ERuppel, SPadyana, AK Substituted benzamides as RIPK2 inhibitors US Patent US10138222 Publication Date 11/27/2018
 
Receptor-interacting serine/threonine-protein kinase 2
Name:Receptor-interacting serine/threonine-protein kinase 2
Type:Protein
Mol. Mass.:61201.30
Organism:Homo sapiens (Human)
Description:n/a
Residue:540
BDBM303362
NameBDBM303362
Synonyms:US10138222, Example 77
TypeSmall organic molecule
Emp. Form.C25H29FN6O
Mol. Mass.448.5358
SMILESCN1CCC(CC1)Nc1cncc(c1)-n1cc(cn1)-c1cc(C(=O)NC2CC2)c(F)cc1C