Reaction Details
TargetReceptor-interacting serine/threonine-protein kinase 2
LigandBDBM303427
Substrate/Competitorn/a
Meas. Tech.V9103X ADP-Glo Kinase Assay Custom
IC50 1.70±n/a nM
Citation Cui, JGao, DALiu, PMcKibben, BPMiller, CARazavi, HSpencer, ERuppel, SPadyana, AK Substituted benzamides as RIPK2 inhibitors US Patent US10138222 Publication Date 11/27/2018
 
Receptor-interacting serine/threonine-protein kinase 2
Name:Receptor-interacting serine/threonine-protein kinase 2
Type:Protein
Mol. Mass.:61201.30
Organism:Homo sapiens (Human)
Description:n/a
Residue:540
BDBM303427
NameBDBM303427
Synonyms:US10138222, Example 155
TypeSmall organic molecule
Emp. Form.C30H38N6O2
Mol. Mass.514.6617
SMILESCc1ccc(cc1-c1cnn(c1)-c1cncc(NC2CCN(CC3CCOCC3)CC2)c1)C(=O)NC1CC1