Reaction Details
TargetTyrosine-protein kinase BTK
LigandBDBM303528
Substrate/Competitorn/a
Meas. Tech.BTK Assay
IC50 0.730±n/a nM
Citation Bentzien, JBerry, AKBosanac, TBurke, MJDisalvo, DTHoran, JCLiang, SMao, CMao, WShen, YSoleymanzadeh, FZindell, RM Heteroaromatic compounds as BTK inhibitors US Patent US10138229 Publication Date 11/27/2018
 
Tyrosine-protein kinase BTK
Name:Tyrosine-protein kinase BTK
Type:Enzyme
Mol. Mass.:76289.95
Organism:Homo sapiens (Human)
Description:Q06187
Residue:659
BDBM303528
NameBDBM303528
Synonyms:US10138229, Example 41 | US10875852, Example 41
TypeSmall organic molecule
Emp. Form.C26H25N5O3
Mol. Mass.455.5084
SMILESCC#CC(=O)N1CC2(CC(C2)n2nc(c(C(N)=O)c2N)-c2ccc(Oc3ccccc3)cc2)C1