Reaction Details
TargetTyrosine-protein kinase BTK
LigandBDBM303535
Substrate/Competitorn/a
Meas. Tech.BTK Assay
IC50 1.20±n/a nM
Citation Bentzien, JBerry, AKBosanac, TBurke, MJDisalvo, DTHoran, JCLiang, SMao, CMao, WShen, YSoleymanzadeh, FZindell, RM Heteroaromatic compounds as BTK inhibitors US Patent US10138229 Publication Date 11/27/2018
 
Tyrosine-protein kinase BTK
Name:Tyrosine-protein kinase BTK
Type:Enzyme
Mol. Mass.:76289.95
Organism:Homo sapiens (Human)
Description:Q06187
Residue:659
BDBM303535
NameBDBM303535
Synonyms:US10138229, Example 46 | US10875852, Example 46
TypeSmall organic molecule
Emp. Form.C24H24N4O3
Mol. Mass.416.4724
SMILESNC(=O)c1[nH]c(nc1-c1ccc(Oc2ccccc2)cc1)[C@@H]1CCCN(C1)C(=O)C=C