Reaction Details
TargetTyrosine-protein kinase BTK
LigandBDBM303547
Substrate/Competitorn/a
Meas. Tech.BTK Assay
IC50 1.10±n/a nM
Citation Bentzien, JBerry, AKBosanac, TBurke, MJDisalvo, DTHoran, JCLiang, SMao, CMao, WShen, YSoleymanzadeh, FZindell, RM Heteroaromatic compounds as BTK inhibitors US Patent US10138229 Publication Date 11/27/2018
 
Tyrosine-protein kinase BTK
Name:Tyrosine-protein kinase BTK
Type:Enzyme
Mol. Mass.:76289.95
Organism:Homo sapiens (Human)
Description:Q06187
Residue:659
BDBM303547
NameBDBM303547
Synonyms:US10138229, Example 58 | US10875852, Example 58
TypeSmall organic molecule
Emp. Form.C26H23N3O3S
Mol. Mass.457.544
SMILESCC#CC(=O)N1CC2(CC(C2)c2nc(c(s2)C(N)=O)-c2ccc(Oc3ccccc3)cc2)C1