Reaction Details
TargetTyrosine-protein kinase BTK
LigandBDBM303568
Substrate/Competitorn/a
Meas. Tech.BTK Assay
IC50 0.930±n/a nM
Citation Bentzien, JBerry, AKBosanac, TBurke, MJDisalvo, DTHoran, JCLiang, SMao, CMao, WShen, YSoleymanzadeh, FZindell, RM Heteroaromatic compounds as BTK inhibitors US Patent US10138229 Publication Date 11/27/2018
 
Tyrosine-protein kinase BTK
Name:Tyrosine-protein kinase BTK
Type:Enzyme
Mol. Mass.:76289.95
Organism:Homo sapiens (Human)
Description:Q06187
Residue:659
BDBM303568
NameBDBM303568
Synonyms:US10138229, Example 80 | US10875852, Example 80
TypeSmall organic molecule
Emp. Form.C26H27N5O3
Mol. Mass.457.5243
SMILESNC(=O)c1c(N)n(nc1-c1ccc(Oc2ccccc2)cc1)[C@H]1C[C@]2(C1)CCN(C2)C(=O)C=C