Reaction Details
TargetTyrosine-protein kinase BTK
LigandBDBM303586
Substrate/Competitorn/a
Meas. Tech.BTK Assay
IC50 0.700±n/a nM
Citation Bentzien, JBerry, AKBosanac, TBurke, MJDisalvo, DTHoran, JCLiang, SMao, CMao, WShen, YSoleymanzadeh, FZindell, RM Heteroaromatic compounds as BTK inhibitors US Patent US10138229 Publication Date 11/27/2018
 
Tyrosine-protein kinase BTK
Name:Tyrosine-protein kinase BTK
Type:Enzyme
Mol. Mass.:76289.95
Organism:Homo sapiens (Human)
Description:Q06187
Residue:659
BDBM303586
NameBDBM303586
Synonyms:US10138229, Example 98 | US10875852, Example 98
TypeSmall organic molecule
Emp. Form.C29H34N6O3
Mol. Mass.514.6187
SMILESCN(C)C\C=C\C(=O)N1CC[C@]2(C[C@@H](C2)n2nc(c(C(N)=O)c2N)-c2ccc(Oc3ccccc3)cc2)C1