Reaction Details
TargetTyrosine-protein kinase BTK
LigandBDBM303590
Substrate/Competitorn/a
Meas. Tech.BTK Assay
IC50 2.70±n/a nM
Citation Bentzien, JBerry, AKBosanac, TBurke, MJDisalvo, DTHoran, JCLiang, SMao, CMao, WShen, YSoleymanzadeh, FZindell, RM Heteroaromatic compounds as BTK inhibitors US Patent US10138229 Publication Date 11/27/2018
 
Tyrosine-protein kinase BTK
Name:Tyrosine-protein kinase BTK
Type:Enzyme
Mol. Mass.:76289.95
Organism:Homo sapiens (Human)
Description:Q06187
Residue:659
BDBM303590
NameBDBM303590
Synonyms:US10138229, Example 102 | US10875852, Example 102
TypeSmall organic molecule
Emp. Form.C25H24N6O3
Mol. Mass.456.4965
SMILESCC#CC(=O)N1CC2(CC(C2)n2nc(c(C(N)=O)c2N)-c2ccc(Oc3ccccc3)nc2)C1