Reaction Details
TargetTyrosine-protein kinase BTK
LigandBDBM303591
Substrate/Competitorn/a
Meas. Tech.BTK Assay
IC50 2.80±n/a nM
Citation Bentzien, JBerry, AKBosanac, TBurke, MJDisalvo, DTHoran, JCLiang, SMao, CMao, WShen, YSoleymanzadeh, FZindell, RM Heteroaromatic compounds as BTK inhibitors US Patent US10138229 Publication Date 11/27/2018
 
Tyrosine-protein kinase BTK
Name:Tyrosine-protein kinase BTK
Type:Enzyme
Mol. Mass.:76289.95
Organism:Homo sapiens (Human)
Description:Q06187
Residue:659
BDBM303591
NameBDBM303591
Synonyms:US10138229, Example 103 | US10875852, Example 103
TypeSmall organic molecule
Emp. Form.C24H24N6O3
Mol. Mass.444.4858
SMILESNC(=O)c1c(N)n(nc1-c1ccc(Oc2ccccc2)cn1)C1CC2(C1)CN(C2)C(=O)C=C