Reaction Details
TargetTyrosine-protein kinase BTK
LigandBDBM303602
Substrate/Competitorn/a
Meas. Tech.BTK Assay
IC50 3.40±n/a nM
Citation Bentzien, JBerry, AKBosanac, TBurke, MJDisalvo, DTHoran, JCLiang, SMao, CMao, WShen, YSoleymanzadeh, FZindell, RM Heteroaromatic compounds as BTK inhibitors US Patent US10138229 Publication Date 11/27/2018
 
Tyrosine-protein kinase BTK
Name:Tyrosine-protein kinase BTK
Type:Enzyme
Mol. Mass.:76289.95
Organism:Homo sapiens (Human)
Description:Q06187
Residue:659
BDBM303602
NameBDBM303602
Synonyms:BDBM303611 US10875852, Example 123
TypeSmall organic molecule
Emp. Form.C25H26N6O3
Mol. Mass.458.5123
SMILESNC(=O)c1c(N)n(nc1-c1ccc(Oc2ccccc2)nc1)[C@H]1C[C@@]2(C1)CCN(C2)C(=O)C=C