Reaction Details
TargetTyrosine-protein kinase BTK
LigandBDBM303648
Substrate/Competitorn/a
Meas. Tech.BTK Assay
IC50 1.40±n/a nM
Citation Bentzien, JBerry, AKBosanac, TBurke, MJDisalvo, DTHoran, JCLiang, SMao, CMao, WShen, YSoleymanzadeh, FZindell, RM Heteroaromatic compounds as BTK inhibitors US Patent US10138229 Publication Date 11/27/2018
 
Tyrosine-protein kinase BTK
Name:Tyrosine-protein kinase BTK
Type:Enzyme
Mol. Mass.:76289.95
Organism:Homo sapiens (Human)
Description:Q06187
Residue:659
BDBM303648
NameBDBM303648
Synonyms:US10138229, Example 160 | US10875852, Example 160
TypeSmall organic molecule
Emp. Form.C22H22F3N5O3
Mol. Mass.461.437
SMILESCC#CC(=O)N1CC[C@@]2(C[C@@H](C2)n2nc(c(C(N)=O)c2N)-c2ccc(OC(F)(F)F)cc2)C1