Reaction Details
TargetReceptor-interacting serine/threonine-protein kinase 2
LigandBDBM303823
Substrate/Competitorn/a
Meas. Tech.V9103X ADP-Glo Kinase Assay
IC50 0.990±n/a nM
Citation Liu, PMiller, CAYu, MZhang, ZRuppel, SPadyana, AK Substituted benzamides as RIPK2 inhibitors US Patent US10138241 Publication Date 11/27/2018
 
Receptor-interacting serine/threonine-protein kinase 2
Name:Receptor-interacting serine/threonine-protein kinase 2
Type:Protein
Mol. Mass.:61201.30
Organism:Homo sapiens (Human)
Description:n/a
Residue:540
BDBM303823
NameBDBM303823
Synonyms:US10138241, Example 7 | US11130754, Example 7
TypeSmall organic molecule
Emp. Form.C18H15ClFN5O2S
Mol. Mass.419.86
SMILESCC(=O)Nc1ncc(s1)-n1cc(cn1)-c1cc(C(=O)NC2CC2)c(F)cc1Cl