Reaction Details
TargetReceptor-interacting serine/threonine-protein kinase 2
LigandBDBM303912
Substrate/Competitorn/a
Meas. Tech.V9103X ADP-Glo Kinase Assay
IC50 1.60±n/a nM
Citation Liu, PMiller, CAYu, MZhang, ZRuppel, SPadyana, AK Substituted benzamides as RIPK2 inhibitors US Patent US10138241 Publication Date 11/27/2018
 
Receptor-interacting serine/threonine-protein kinase 2
Name:Receptor-interacting serine/threonine-protein kinase 2
Type:Protein
Mol. Mass.:61201.30
Organism:Homo sapiens (Human)
Description:n/a
Residue:540
BDBM303912
NameBDBM303912
Synonyms:US10138241, Example 99 | US11130754, Example 99
TypeSmall organic molecule
Emp. Form.C26H27FN6O
Mol. Mass.458.5306
SMILESCN1CC[C@H](C1)c1ccc2ncc(-n3cc(cn3)-c3cc(C(=O)NC4CC4)c(F)cc3C)n2c1