Reaction Details
TargetcAMP and cAMP-inhibited cGMP 3',5'-cyclic phosphodiesterase 10A
LigandBDBM304030
Substrate/Competitorn/a
Meas. Tech. Assay of Phosphodiesterase 10 Inhibition In Vitro
IC50 47.0±n/a nM
Citation Moszczynski-Petkowski, RBojarski, LWieczorek, MMajer, JJanowska, SMatloka, MBorkowska, MStefaniak, FLamparska-Przybysz, MDubiel, K Fused triazole derivatives as phosphodiesterase 10A inhibitors US Patent US10138245 Publication Date 11/27/2018
 
cAMP and cAMP-inhibited cGMP 3',5'-cyclic phosphodiesterase 10A
Name:cAMP and cAMP-inhibited cGMP 3',5'-cyclic phosphodiesterase 10A
Type:Protein
Mol. Mass.:88412.52
Organism:Homo sapiens (Human)
Description:Q9Y233
Residue:779
BDBM304030
NameBDBM304030
Synonyms:5,7-Dimethyl-2-(2-phenyl-1H-benzo[d]imidazol-5-yl)-[1,2,4]triazolo-[1,5-a]pyrimidine | US10138245, Example 1
TypeSmall organic molecule
Emp. Form.C20H16N6
Mol. Mass.340.3812
SMILESCc1cc(C)n2nc(nc2n1)-c1ccc2[nH]c(nc2c1)-c1ccccc1