Reaction Details
TargetcAMP and cAMP-inhibited cGMP 3',5'-cyclic phosphodiesterase 10A
LigandBDBM304034
Substrate/Competitorn/a
Meas. Tech. Assay of Phosphodiesterase 10 Inhibition In Vitro
IC50 953±n/a nM
Citation Moszczynski-Petkowski, RBojarski, LWieczorek, MMajer, JJanowska, SMatloka, MBorkowska, MStefaniak, FLamparska-Przybysz, MDubiel, K Fused triazole derivatives as phosphodiesterase 10A inhibitors US Patent US10138245 Publication Date 11/27/2018
 
cAMP and cAMP-inhibited cGMP 3',5'-cyclic phosphodiesterase 10A
Name:cAMP and cAMP-inhibited cGMP 3',5'-cyclic phosphodiesterase 10A
Type:Protein
Mol. Mass.:88412.52
Organism:Homo sapiens (Human)
Description:Q9Y233
Residue:779
BDBM304034
NameBDBM304034
Synonyms:5,7-Dimethyl-2-[3-(pyridin-4-yl)-1H-benzimidazol-5-yl][1,2,4]triazolo[1,5-a]pyrimidine | US10138245, Example 5
TypeSmall organic molecule
Emp. Form.C19H15N7
Mol. Mass.341.3693
SMILESCc1cc(C)n2nc(nc2n1)-c1ccc2[nH]c(nc2c1)-c1ccncc1