Reaction Details
TargetcAMP and cAMP-inhibited cGMP 3',5'-cyclic phosphodiesterase 10A
LigandBDBM304037
Substrate/Competitorn/a
Meas. Tech. Assay of Phosphodiesterase 10 Inhibition In Vitro
IC50 84.0±n/a nM
Citation Moszczynski-Petkowski, RBojarski, LWieczorek, MMajer, JJanowska, SMatloka, MBorkowska, MStefaniak, FLamparska-Przybysz, MDubiel, K Fused triazole derivatives as phosphodiesterase 10A inhibitors US Patent US10138245 Publication Date 11/27/2018
 
cAMP and cAMP-inhibited cGMP 3',5'-cyclic phosphodiesterase 10A
Name:cAMP and cAMP-inhibited cGMP 3',5'-cyclic phosphodiesterase 10A
Type:Protein
Mol. Mass.:88412.52
Organism:Homo sapiens (Human)
Description:Q9Y233
Residue:779
BDBM304037
NameBDBM304037
Synonyms:5,8-Dimethyl-2-[2-(1,3-thiazol-2-yl)-1H-benz-imidazol-5-yl][1,2,4]triazolo[1,5-a]pyrazine | US10138245, Example 8
TypeSmall organic molecule
Emp. Form.C17H13N7S
Mol. Mass.347.397
SMILESCc1cnc(C)c2nc(nn12)-c1ccc2[nH]c(nc2c1)-c1nccs1