Reaction Details
TargetTGF-beta receptor type-1
LigandBDBM50015639
Substrate/Competitorn/a
Meas. Tech.Cell-Free Assay for Evaluating Inhibition of ALK5 Kinase Phosphorylatio
IC50 6.68±n/a nM
Citation Kim, DSheen, YYJin, CPark, CDomalapally, SKota, SRMaddeboina, KVura Bala, S Methods of treating fibrosis, cancer and vascular injuries US Patent US Patent
 
TGF-beta receptor type-1
Name:TGF-beta receptor type-1
Type:enzyme
Mol. Mass.:55968.24
Organism:Homo sapiens (Human)
Description:P36897
Residue:503
BDBM50015639
NameBDBM50015639
Synonyms:CHEMBL3260567 | USRE47141, Example 2
TypeSmall organic molecule
Emp. Form.C22H18FN7
Mol. Mass.399.4236
SMILESCc1cccc(n1)-c1[nH]c(CNc2ccccc2F)nc1-c1ccc2ncnn2c1