Reaction Details
TargetCoagulation factor XI
LigandBDBM304105
Substrate/Competitorn/a
Meas. Tech.Factor XIa Assay
IC50 0.560±n/a nM
Citation Shen, DKuang, RKumar, PDuffy, JLZhu, CAli, AYang, MDebenham, JS Factor XIa inhibitors US Patent US10143681 Publication Date 12/4/2018
 
Coagulation factor XI
Name:Coagulation factor XI
Type:Enzyme
Mol. Mass.:70130.58
Organism:Homo sapiens (Human)
Description:P03951
Residue:625
BDBM304105
NameBDBM304105
Synonyms:(S)- or (R)-4-[(2-{5-[3-chloro-6- (difluoromethoxy)-2- fluorophenyl]-1-oxidopyridin-2- yl}-3- cyclobutylpropanoyl)amino] benzoic acid US10143681, Example 14
TypeSmall organic molecule
Emp. Form.C26H22ClF3N2O5
Mol. Mass.534.911
SMILESOC(=O)c1ccc(NC(=O)C(CC2CCC2)c2ccc(c[n+]2[O-])-c2c(F)c(Cl)ccc2OC(F)F)cc1