Reaction Details
TargetCoagulation factor XI
LigandBDBM304109
Substrate/Competitorn/a
Meas. Tech.Factor XIa Assay
IC50 0.450±n/a nM
Citation Shen, DKuang, RKumar, PDuffy, JLZhu, CAli, AYang, MDebenham, JS Factor XIa inhibitors US Patent US10143681 Publication Date 12/4/2018
 
Coagulation factor XI
Name:Coagulation factor XI
Type:Enzyme
Mol. Mass.:70130.58
Organism:Homo sapiens (Human)
Description:P03951
Residue:625
BDBM304109
NameBDBM304109
Synonyms:(S)- or (R)-4-[(2-{5-[3-chloro-6- (difluoromethoxy)-2- fluorophenyl]-1-oxidopyridin-2- yl}-3- cyclopentylpropanoyl)amino] benzoic acid US10143681, Example 18
TypeSmall organic molecule
Emp. Form.C27H24ClF3N2O5
Mol. Mass.548.938
SMILESOC(=O)c1ccc(NC(=O)C(CC2CCCC2)c2ccc(c[n+]2[O-])-c2c(F)c(Cl)ccc2OC(F)F)cc1