Reaction Details
TargetCoagulation factor XI
LigandBDBM304198
Substrate/Competitorn/a
Meas. Tech.Factor XIa Assay
IC50 0.600±n/a nM
Citation Shen, DKuang, RKumar, PDuffy, JLZhu, CAli, AYang, MDebenham, JS Factor XIa inhibitors US Patent US10143681 Publication Date 12/4/2018
 
Coagulation factor XI
Name:Coagulation factor XI
Type:Enzyme
Mol. Mass.:70130.58
Organism:Homo sapiens (Human)
Description:P03951
Residue:625
BDBM304198
NameBDBM304198
Synonyms:2-(1-((4- carboxyphenyl)amino)-3-(2- (difluoromethyl)cyclopropyl)- 1-oxopropan-2-yl)-5-(3- chloro-6-(difluoromethyl)- 2-fluorophenyl)pyridine-1- oxide US10143681, Example 89
TypeSmall organic molecule
Emp. Form.C26H20ClF5N2O4
Mol. Mass.554.893
SMILESOC(=O)c1ccc(NC(=O)C(CC2CC2C(F)F)c2ccc(c[n+]2[O-])-c2c(F)c(Cl)ccc2C(F)F)cc1