Reaction Details
TargetIsoform 1 of Metabotropic glutamate receptor 5 (5a)
LigandBDBM174266
Substrate/Competitorn/a
Meas. Tech.mGluR5 FLIPR Assay
EC50 31±n/a nM
Citation Degnan, APMaxwell, DHill, MDFang, HParker, MFYang, FBronson, JJMacor, JE Oxazolidinones as modulators of mGluR5 US Patent US9688669 Publication Date 6/27/2017
 
Isoform 1 of Metabotropic glutamate receptor 5 (5a)
Name:Isoform 1 of Metabotropic glutamate receptor 5 (5a)
Type:Enzyme
Mol. Mass.:128885.13
Organism:Homo sapiens (Human)
Description:P41594-2
Residue:1180
BDBM174266
NameBDBM174266
Synonyms:US9688669, Example 97
TypeSmall organic molecule
Emp. Form.C20H15F3N2O2
Mol. Mass.372.3405
SMILESFc1cccc(c1)[C@H]1OC(=O)N[C@@H]1c1cncc(c1)C#CC1CC(F)(F)C1