Reaction Details
TargetReceptor tyrosine-protein kinase erbB-2
LigandBDBM304240
Substrate/Competitorn/a
Meas. Tech.JIMT1 Cell Viability Assay for Antibody-Polymer-Drug Conjugates
IC50 1.10±n/a nM
Citation Yin, MThomas, JDYurkovetskiy, AVConlon, PRDu, BKelleher, EWLowinger, TBTang, S Pyrrolobenzodiazepines and conjugates thereof US Patent US10143695 Publication Date 12/4/2018
 
Receptor tyrosine-protein kinase erbB-2
Name:Receptor tyrosine-protein kinase erbB-2
Type:n/a
Mol. Mass.:137894.47
Organism:Homo sapiens (Human)
Description:P04626
Residue:1255
BDBM304240
NameBDBM304240
Synonyms:US10143695, Compound 7A
TypeSmall organic molecule
Emp. Form.C44H44N10O8
Mol. Mass.840.8824
SMILESCOc1ccc2n(ccc2c1)C(=O)c1cc(NC(=O)c2cc(NC(=O)c3nc(NC(=O)CCCOc4cc5N=C[C@@H]6CC(=C)CN6C(=O)c5cc4OC)cn3C)cn2C)cn1C