Reaction Details
TargetReceptor tyrosine-protein kinase erbB-2
LigandBDBM304245
Substrate/Competitorn/a
Meas. Tech.NCI-N87 Cell Viability Assay for Antibody-Polymer-Drug Conjugates
IC50 1.02±n/a nM
Citation Yin, MThomas, JDYurkovetskiy, AVConlon, PRDu, BKelleher, EWLowinger, TBTang, S Pyrrolobenzodiazepines and conjugates thereof US Patent US10143695 Publication Date 12/4/2018
 
Receptor tyrosine-protein kinase erbB-2
Name:Receptor tyrosine-protein kinase erbB-2
Type:n/a
Mol. Mass.:137894.47
Organism:Homo sapiens (Human)
Description:P04626
Residue:1255
BDBM304245
NameBDBM304245
Synonyms:US10143695, Compound 28
TypeSmall organic molecule
Emp. Form.C42H42N12O7
Mol. Mass.826.8591
SMILESCOc1cc2c(cc1OCCCC(=O)Nc1cn(C)c(n1)C(=O)Nc1cc(C(=O)Nc3cc(C(=O)n4ncc5ccc(N)cc45)n(C)c3)n(C)c1)N=C[C@@H]1CC(=C)CN1C2=O