Reaction Details
TargetReceptor tyrosine-protein kinase erbB-2
LigandBDBM304254
Substrate/Competitorn/a
Meas. Tech.NCI-N87 Cell Viability Assay for Antibody-Polymer-Drug Conjugates
IC50 0.290±n/a nM
Citation Yin, MThomas, JDYurkovetskiy, AVConlon, PRDu, BKelleher, EWLowinger, TBTang, S Pyrrolobenzodiazepines and conjugates thereof US Patent US10143695 Publication Date 12/4/2018
 
Receptor tyrosine-protein kinase erbB-2
Name:Receptor tyrosine-protein kinase erbB-2
Type:n/a
Mol. Mass.:137894.47
Organism:Homo sapiens (Human)
Description:P04626
Residue:1255
BDBM304254
NameBDBM304254
Synonyms:US10143695, Compound 78
TypeSmall organic molecule
Emp. Form.C46H43N11O7
Mol. Mass.861.9031
SMILESCOc1cc2c(cc1OCCCC(=O)Nc1cn(C)c(n1)C(=O)Nc1cc(C(=O)Nc3cc(C(=O)n4ccc5cc(N)ccc45)n(C)c3)n(C)c1)N=C[C@@H]1Cc3ccccc3N1C2=O