Reaction Details
TargetOxysterols receptor LXR-beta
LigandBDBM304392
Substrate/Competitorn/a
Meas. Tech.LXR alpha/beta Radioligand Binding Assay
Ki 8.00±n/a nM
Citation Claremon, DADong, CFan, YLeftheris, KLotesta, SDSingh, SBTice, CMZhao, WZheng, YZhuang, L Piperazine derivatives as liver X receptor modulators US Patent US10144715 Publication Date 12/4/2018
 
Oxysterols receptor LXR-beta
Name:Oxysterols receptor LXR-beta
Type:Enzyme Catalytic Domain
Mol. Mass.:50978.79
Organism:Homo sapiens (Human)
Description:P55055
Residue:460
BDBM304392
NameBDBM304392
Synonyms:US10144715, Compound 9-7 | ethyl (R)-2-(4-(4-fluoro-3-(methylsulfonyl)phenyl)-2-isobutylpiperazin-1-yl)-4-(trifluoromethyl)pyrimidine-5-carboxylate
TypeSmall organic molecule
Emp. Form.C23H28F4N4O4S
Mol. Mass.532.551
SMILESCCOC(=O)c1cnc(nc1C(F)(F)F)N1CCN(C[C@H]1C(C)CC)c1ccc(F)c(c1)S(C)(=O)=O