Reaction Details
TargetOxysterols receptor LXR-beta
LigandBDBM304431
Substrate/Competitorn/a
Meas. Tech.LXR alpha/beta Radioligand Binding Assay
Ki 23.0±n/a nM
Citation Claremon, DADong, CFan, YLeftheris, KLotesta, SDSingh, SBTice, CMZhao, WZheng, YZhuang, L Piperazine derivatives as liver X receptor modulators US Patent US10144715 Publication Date 12/4/2018
 
Oxysterols receptor LXR-beta
Name:Oxysterols receptor LXR-beta
Type:Enzyme Catalytic Domain
Mol. Mass.:50978.79
Organism:Homo sapiens (Human)
Description:P55055
Residue:460
BDBM304431
NameBDBM304431
Synonyms:1-(2-((R)-4-(4-fluoro-3-(methylsulfonyl)phenyl)-2-isopropylpiperazin-1-yl)-4-(trifluoromethyl)pyrimidin-5-yl)ethan-1-ol US10144715, Compound 13-1
TypeSmall organic molecule
Emp. Form.C21H26F4N4O3S
Mol. Mass.490.515
SMILESCC(C)[C@@H]1CN(CCN1c1ncc(C(C)O)c(n1)C(F)(F)F)c1ccc(F)c(c1)S(C)(=O)=O