Reaction Details
TargetOxysterols receptor LXR-beta
LigandBDBM304441
Substrate/Competitorn/a
Meas. Tech.LXR alpha/beta Radioligand Binding Assay
Ki 3.00±n/a nM
Citation Claremon, DADong, CFan, YLeftheris, KLotesta, SDSingh, SBTice, CMZhao, WZheng, YZhuang, L Piperazine derivatives as liver X receptor modulators US Patent US10144715 Publication Date 12/4/2018
 
Oxysterols receptor LXR-beta
Name:Oxysterols receptor LXR-beta
Type:Enzyme Catalytic Domain
Mol. Mass.:50978.79
Organism:Homo sapiens (Human)
Description:P55055
Residue:460
BDBM304441
NameBDBM304441
Synonyms:(R)-5-(4-(5-acetyl-4-(trifluoromethyl)pyrimidin-2-yl)-3-isopropylpiperazin-1-yl)-2-fluoro-N-methylbenzenesulfonamide | US10144715, Compound 13-2
TypeSmall organic molecule
Emp. Form.C24H22F5N5O3S
Mol. Mass.555.52
SMILESCNS(=O)(=O)c1cc(ccc1F)N1CCN([C@@H](C1)c1ccc(F)cc1)c1ncc(C(C)=O)c(n1)C(F)(F)F