Reaction Details
TargetOxysterols receptor LXR-beta
LigandBDBM304452
Substrate/Competitorn/a
Meas. Tech.LXR alpha/beta Radioligand Binding Assay
Ki 1.000±n/a nM
Citation Claremon, DADong, CFan, YLeftheris, KLotesta, SDSingh, SBTice, CMZhao, WZheng, YZhuang, L Piperazine derivatives as liver X receptor modulators US Patent US10144715 Publication Date 12/4/2018
 
Oxysterols receptor LXR-beta
Name:Oxysterols receptor LXR-beta
Type:Enzyme Catalytic Domain
Mol. Mass.:50978.79
Organism:Homo sapiens (Human)
Description:P55055
Residue:460
BDBM304452
NameBDBM304452
Synonyms:(R)-2-(4-(4-fluoro-3-(methylsulfonyl)phenyl)-2-isopropylpiperazin-1-yl)-5-((methylthio)methyl)-4-(trifluoromethyl)pyrimidine | US10144715, Compound 15-8
TypeSmall organic molecule
Emp. Form.C21H26F4N4O2S2
Mol. Mass.506.58
SMILESCSCc1cnc(nc1C(F)(F)F)N1CCN(C[C@H]1C(C)C)c1ccc(F)c(c1)S(C)(=O)=O