Reaction Details
TargetOxysterols receptor LXR-alpha
LigandBDBM304509
Substrate/Competitorn/a
Meas. Tech.LXR alpha/beta Radioligand Binding Assay
Ki 32.0±n/a nM
Citation Claremon, DADong, CFan, YLeftheris, KLotesta, SDSingh, SBTice, CMZhao, WZheng, YZhuang, L Piperazine derivatives as liver X receptor modulators US Patent US10144715 Publication Date 12/4/2018
 
Oxysterols receptor LXR-alpha
Name:Oxysterols receptor LXR-alpha
Type:Enzyme Catalytic Domain
Mol. Mass.:50403.85
Organism:Homo sapiens (Human)
Description:Q13133
Residue:447
BDBM304509
NameBDBM304509
Synonyms:(R)-2-(2-(4-(4-(hydroxymethyl)-3-(methylsulfonyl)phenyl)-2-isopropylpiperazin-1-yl)-4-(trifluoromethyl)pyrimidin-5-yl)-2-methylpropanenitrile | US10144715, Compound 25-1
TypeSmall organic molecule
Emp. Form.C25H32F3N5O3S
Mol. Mass.539.613
SMILESCC(C)[C@@H]1CN(CCN1c1ncc(c(n1)C(F)(F)F)C(C)(C)C#N)c1ccc(CCO)c(c1)S(C)(=O)=O