Reaction Details
TargetOxysterols receptor LXR-alpha
LigandBDBM304514
Substrate/Competitorn/a
Meas. Tech.LXR alpha/beta Radioligand Binding Assay
Ki 9.00±n/a nM
Citation Claremon, DADong, CFan, YLeftheris, KLotesta, SDSingh, SBTice, CMZhao, WZheng, YZhuang, L Piperazine derivatives as liver X receptor modulators US Patent US10144715 Publication Date 12/4/2018
 
Oxysterols receptor LXR-alpha
Name:Oxysterols receptor LXR-alpha
Type:Enzyme Catalytic Domain
Mol. Mass.:50403.85
Organism:Homo sapiens (Human)
Description:Q13133
Residue:447
BDBM304514
NameBDBM304514
Synonyms:(R)-2-(4-(4-fluoro-3-(methylsulfonyl)phenyl)-2-isopropylpiperazin-1-yl)-5-methoxy-4-(trifluoromethyl)pyrimidine | US10144715, Compound 29-1
TypeSmall organic molecule
Emp. Form.C26H34BF3N4O4
Mol. Mass.534.379
SMILESCC(C)[C@@H]1CN(CCN1c1ncc(B2OC(C)(C)C(C)(C)O2)c(n1)C(F)(F)F)C(=O)OCc1ccccc1