Reaction Details
TargetOxysterols receptor LXR-alpha
LigandBDBM304525
Substrate/Competitorn/a
Meas. Tech.LXR alpha/beta Radioligand Binding Assay
Ki 53.0±n/a nM
Citation Claremon, DADong, CFan, YLeftheris, KLotesta, SDSingh, SBTice, CMZhao, WZheng, YZhuang, L Piperazine derivatives as liver X receptor modulators US Patent US10144715 Publication Date 12/4/2018
 
Oxysterols receptor LXR-alpha
Name:Oxysterols receptor LXR-alpha
Type:Enzyme Catalytic Domain
Mol. Mass.:50403.85
Organism:Homo sapiens (Human)
Description:Q13133
Residue:447
BDBM304525
NameBDBM304525
Synonyms:(R)-2-(2-(4-(4-fluoro-3-(methylsulfonyl)phenyl)-2-isopropylpiperazin-1-yl)-5-(trifluoromethyl)pyrimidin-4-yl)propan-2-ol | US10144715, Compound 39-1
TypeSmall organic molecule
Emp. Form.C22H28F4N4O3S
Mol. Mass.504.541
SMILESCC(C)[C@@H]1CN(CCN1c1ncc(c(n1)C(C)(C)O)C(F)(F)F)c1ccc(F)c(c1)S(C)(=O)=O