Reaction Details
TargetOxysterols receptor LXR-alpha
LigandBDBM304622
Substrate/Competitorn/a
Meas. Tech.Human LXRalpha and LXRbeta Coactivator Recruitment FRET Assay
EC50 287±n/a nM
Citation Claremon, DADong, CFan, YLeftheris, KLotesta, SDSingh, SBTice, CMZhao, WZheng, YZhuang, L Piperazine derivatives as liver X receptor modulators US Patent US10144715 Publication Date 12/4/2018
 
Oxysterols receptor LXR-alpha
Name:Oxysterols receptor LXR-alpha
Type:Enzyme Catalytic Domain
Mol. Mass.:50403.85
Organism:Homo sapiens (Human)
Description:Q13133
Residue:447
BDBM304622
NameBDBM304622
Synonyms:(S)-1-(((1s,4R)-4-(difluoromethyl)cyclohexyl)methyl)-4-(3-(methylsulfonyl)phenyl)-2-phenylpiperazine | US10144715, Compound 48-17
TypeSmall organic molecule
Emp. Form.C25H30F2N2O3S
Mol. Mass.476.579
SMILESCS(=O)(=O)c1cccc(c1)N1CCN([C@H](C1)c1ccccc1)C(=O)C1CC[C@@H](CC1)C(F)F