Reaction Details
TargetOxysterols receptor LXR-beta
LigandBDBM304631
Substrate/Competitorn/a
Meas. Tech.LXR alpha/beta Radioligand Binding Assay
Ki 8.00±n/a nM
Citation Claremon, DADong, CFan, YLeftheris, KLotesta, SDSingh, SBTice, CMZhao, WZheng, YZhuang, L Piperazine derivatives as liver X receptor modulators US Patent US10144715 Publication Date 12/4/2018
 
Oxysterols receptor LXR-beta
Name:Oxysterols receptor LXR-beta
Type:Enzyme Catalytic Domain
Mol. Mass.:50978.79
Organism:Homo sapiens (Human)
Description:P55055
Residue:460
BDBM304631
NameBDBM304631
Synonyms:(S)-(4-(4-((4,4-dimethylcyclohexyl)methyl)-3-phenylpiperazin-1-yl)-2-(methylsulfonyl)phenyl)methanol | US10144715, Compound 48-26
TypeSmall organic molecule
Emp. Form.C28H38N2O4S
Mol. Mass.498.677
SMILESCC1(C)CCC(CC1)C(=O)N1CCN(C[C@@H]1c1ccccc1)c1ccc(CCO)c(c1)S(C)(=O)=O