Reaction Details
TargetOxysterols receptor LXR-beta
LigandBDBM304636
Substrate/Competitorn/a
Meas. Tech.LXR alpha/beta Radioligand Binding Assay
Ki 5.00±n/a nM
Citation Claremon, DADong, CFan, YLeftheris, KLotesta, SDSingh, SBTice, CMZhao, WZheng, YZhuang, L Piperazine derivatives as liver X receptor modulators US Patent US10144715 Publication Date 12/4/2018
 
Oxysterols receptor LXR-beta
Name:Oxysterols receptor LXR-beta
Type:Enzyme Catalytic Domain
Mol. Mass.:50978.79
Organism:Homo sapiens (Human)
Description:P55055
Residue:460
BDBM304636
NameBDBM304636
Synonyms:(S)-4-(3-(methylsulfonyl)phenyl)-2-phenyl-1-(((1s,4R)-4-(trifluoromethyl)cyclohexyl)methyl)piperazine | US10144715, Compound 48-31
TypeSmall organic molecule
Emp. Form.C25H29F3N2O3S
Mol. Mass.494.57
SMILESCS(=O)(=O)c1cccc(c1)N1CCN([C@H](C1)c1ccccc1)C(=O)C1CC[C@@H](CC1)C(F)(F)F