Reaction Details
TargetBeta-hexosaminidase subunit beta
LigandBDBM50034220
Substrate/Competitorn/a
Meas. Tech.Inhibition of Mast Cell Degranulation
IC50 4200±n/a nM
Citation Schlechtingen, GKnolker, HFriedrichson, TJennings, GBraxmeier, T Hydroxy-substituted amino and ammonium derivatives and their medical use US Patent US10143668 Publication Date 12/4/2018
 
Beta-hexosaminidase subunit beta
Name:Beta-hexosaminidase subunit beta
Type:Enzyme
Mol. Mass.:63112.58
Organism:Homo sapiens (Human)
Description:P07686
Residue:556
BDBM50034220
NameBDBM50034220
Synonyms:2-(((Hexadecyloxy)hydroxyphosphinyl)oxy)-N,N,N-trimethylethanaminium hydroxide MILTEFOSINE hexadecyl 2-(trimethyl-lambda~5~-azanyl)ethyl hydrogen phosphate hexadecyloxy-2-trimethylammonioethylphosphorate hexadecylphosphocholine, miltefosine | n-hexadecylphosphocholine
TypeSmall organic molecule
Emp. Form.C21H46NO4P
Mol. Mass.407.568
([O-])(=O)OCC[N+](C)(C)C