Reaction Details
TargetPlasma kallikrein
LigandBDBM306475
Substrate/Competitorn/a
Meas. Tech.In Vitro Plasma Kallikrein Inhibition Assay
IC50 3.98±n/a nM
Citation Li, ZZancanella, MYu, CSetti, LQSham, HXu, QYee, CWYu, M Bridged bicyclic kallikrein inhibitors US Patent US10144746 Publication Date 12/4/2018
 
Plasma kallikrein
Name:Plasma kallikrein
Type:Protein
Mol. Mass.:71391.16
Organism:Homo sapiens (Human)
Description:P03952
Residue:638
BDBM306475
NameBDBM306475
Synonyms:(+-)-N-[(6-amino-4-methoxy- 2-methylpyridin-3-yl)methyl]- 12-[(1H-pyrazol-1-yl)methyl]-15- oxatetracyclo[6.6.1.02,7.09,14] pentadeca-2,4,6,9,11,13- hexaene-4-carboxamide | US10144746, Compound 117
TypeSmall organic molecule
Emp. Form.C27H25N5O3
Mol. Mass.467.5191
SMILESCOc1cc(N)nc(C)c1CNC(=O)c1ccc2C3OC(c4cc(Cn5cccn5)ccc34)c2c1