Reaction Details
TargetPlasma kallikrein
LigandBDBM306494
Substrate/Competitorn/a
Meas. Tech.In Vitro Plasma Kallikrein Inhibition Assay
IC50 3.98±n/a nM
Citation Li, ZZancanella, MYu, CSetti, LQSham, HXu, QYee, CWYu, M Bridged bicyclic kallikrein inhibitors US Patent US10144746 Publication Date 12/4/2018
 
Plasma kallikrein
Name:Plasma kallikrein
Type:Protein
Mol. Mass.:71391.16
Organism:Homo sapiens (Human)
Description:P03952
Residue:638
BDBM306494
NameBDBM306494
Synonyms:(+-)-N-[(6-amino-4-ethyl-2- methylpyridin-3-yl)methyl]-12- (2-cyano-4-methylphenyl)-15- oxatetracyclo[6.6.1.02,7.09,14] pentadeca-2,4,6,9,11,13- hexaene-4-carboxamide | US10144746, Compound 136
TypeSmall organic molecule
Emp. Form.C32H28N4O2
Mol. Mass.500.5903
SMILESCCc1cc(N)nc(C)c1CNC(=O)c1ccc2C3OC(c2c1)c1cc(ccc31)-c1ccc(C)cc1C#N