Reaction Details
TargetPlasma kallikrein
LigandBDBM306536
Substrate/Competitorn/a
Meas. Tech.In Vitro Plasma Kallikrein Inhibition Assay
IC50 1.000±n/a nM
Citation Li, ZZancanella, MYu, CSetti, LQSham, HXu, QYee, CWYu, M Bridged bicyclic kallikrein inhibitors US Patent US10144746 Publication Date 12/4/2018
 
Plasma kallikrein
Name:Plasma kallikrein
Type:Protein
Mol. Mass.:71391.16
Organism:Homo sapiens (Human)
Description:P03952
Residue:638
BDBM306536
NameBDBM306536
Synonyms:(1R,8S)-N-[(6-amino-2,4- dimethylpyridin-3-yl)methyl]-12- [(4-chloro-1H-pyrazol-1-yl) methyl]-15-oxatetracyclo [6.6.1.02,7.09,14]-pentadeca- 2,4,6,9,11,13- hexaene-4-carboxamide | US10144746, Compound 179
TypeSmall organic molecule
Emp. Form.C27H24ClN5O2
Mol. Mass.485.965
SMILESCc1cc(N)nc(C)c1CNC(=O)c1ccc2[C@H]3O[C@H](c4cc(Cn5cc(Cl)cn5)ccc34)c2c1