Reaction Details
TargetPlasma kallikrein
LigandBDBM306593
Substrate/Competitorn/a
Meas. Tech.In Vitro Plasma Kallikrein Inhibition Assay
IC50 2.00±n/a nM
Citation Li, ZZancanella, MYu, CSetti, LQSham, HXu, QYee, CWYu, M Bridged bicyclic kallikrein inhibitors US Patent US10144746 Publication Date 12/4/2018
 
Plasma kallikrein
Name:Plasma kallikrein
Type:Protein
Mol. Mass.:71391.16
Organism:Homo sapiens (Human)
Description:P03952
Residue:638
BDBM306593
NameBDBM306593
Synonyms:(1S,8R)-N-[(4-carbamimidoyl- phenyl)methyl]-12-(pyrrolidin- 1-yl)-15-oxatetracyclo [6.6.1.02,7.09,14]pentadeca- 2,4,6.9,11,13-hexaene-4- carboxamide | US10144746, Compound 236
TypeSmall organic molecule
Emp. Form.C27H26N4O2
Mol. Mass.438.5209
SMILESNC(=N)c1ccc(CNC(=O)c2ccc3[C@H]4O[C@H](c5cc(ccc45)N4CCCC4)c3c2)cc1