Reaction Details
TargetPlasma kallikrein
LigandBDBM306604
Substrate/Competitorn/a
Meas. Tech.In Vitro Plasma Kallikrein Inhibition Assay
IC50 5.01±n/a nM
Citation Li, ZZancanella, MYu, CSetti, LQSham, HXu, QYee, CWYu, M Bridged bicyclic kallikrein inhibitors US Patent US10144746 Publication Date 12/4/2018
 
Plasma kallikrein
Name:Plasma kallikrein
Type:Protein
Mol. Mass.:71391.16
Organism:Homo sapiens (Human)
Description:P03952
Residue:638
BDBM306604
NameBDBM306604
Synonyms:(1R,8S)-N-{[6-amino-2-methyl-4- (oxan-4-yl)pyridin-3- yl]methyl)-12-(2,4- difluorophenyl)-15- oxatetracyclo[6.6.1.02,7.09,14] pentadeca-2,4,6,9,11,13- hexaene-4-carboxamide | US10144746, Compound 247
TypeSmall organic molecule
Emp. Form.C33H29F2N3O3
Mol. Mass.553.5985
SMILESCc1nc(N)cc(C2CCOCC2)c1CNC(=O)c1ccc2[C@H]3O[C@@H](c2c1)c1cc(ccc31)-c1ccc(F)cc1F