Reaction Details
TargetPlasma kallikrein
LigandBDBM306662
Substrate/Competitorn/a
Meas. Tech.In Vitro Plasma Kallikrein Inhibition Assay
IC50 1.000±n/a nM
Citation Li, ZZancanella, MYu, CSetti, LQSham, HXu, QYee, CWYu, M Bridged bicyclic kallikrein inhibitors US Patent US10144746 Publication Date 12/4/2018
 
Plasma kallikrein
Name:Plasma kallikrein
Type:Protein
Mol. Mass.:71391.16
Organism:Homo sapiens (Human)
Description:P03952
Residue:638
BDBM306662
NameBDBM306662
Synonyms:(1R,8S)-N-[(4-carbamimidoyl- 2-methylpheny])-methyl]-12- (2,4-difluorophenyl)-15- oxatetracyclo[6.6.1.02,7.09,14] pentadeca-2,4,6,9,11,13- hexaene-4-carboxamide | US10144746, Compound 306
TypeSmall organic molecule
Emp. Form.C30H23F2N3O2
Mol. Mass.495.5193
SMILESCc1cc(ccc1CNC(=O)c1ccc2[C@H]3O[C@@H](c2c1)c1cc(ccc31)-c1ccc(F)cc1F)C(N)=N