Reaction Details
TargetPlasma kallikrein
LigandBDBM306693
Substrate/Competitorn/a
Meas. Tech.In Vitro Plasma Kallikrein Inhibition Assay
IC50 5.89±n/a nM
Citation Li, ZZancanella, MYu, CSetti, LQSham, HXu, QYee, CWYu, M Bridged bicyclic kallikrein inhibitors US Patent US10144746 Publication Date 12/4/2018
 
Plasma kallikrein
Name:Plasma kallikrein
Type:Protein
Mol. Mass.:71391.16
Organism:Homo sapiens (Human)
Description:P03952
Residue:638
BDBM306693
NameBDBM306693
Synonyms:(1R,8S)-N-[(4-carbamimidoyl- 3-methoxyphenyl)-methyl]- 12-(2,4-difluorophenyl)-15- oxatetracyclo[6.6.1.02,7.09,14] pentadeca-2,4,6,9,11,13- hexaene-4-carboxamide | US10144746, Compound 338
TypeSmall organic molecule
Emp. Form.C30H23F2N3O3
Mol. Mass.511.5187
SMILESCOc1cc(CNC(=O)c2ccc3[C@H]4O[C@@H](c3c2)c2cc(ccc42)-c2ccc(F)cc2F)ccc1C(N)=N